{"text_format":"1","workbook":"xlsx","n_sheets":12,"sheets":["Activation","Refreshing...","Support","Home","SelectionCriteria","Parameters","DataSheet","Electricity","Gas","Water","Total Building","Calculated Field Definitions"],"not_rendered":{"charts":0,"images":2,"macros":1,"external_links":0,"defined_names":3,"comments":0,"pivot_tables":4},"unopened":[],"bounds":{"document_bytes":16777216,"sheet_cells":100000,"rows_first":2000,"rows_last":500,"rows_between":2000,"halvings":0,"cell_chars":16384,"cell_head_chars":4096},"cells_cut":0,"cells_raw":0,"read":"whole","date_system":"1900"}

{"sheet":"Activation","index":0,"n_rows":10,"n_cols":3,"rows_kept":10,"cut":false,"hidden":false,"merged":[[9,2,11,8],[14,2,15,8]]}
[]
[]
[]
[]
[]
[]
[]
[]
[]
[null,null,"Click on \"Enable Content\" in the menu above to activate this report"]

{"sheet":"Refreshing...","index":1,"n_rows":10,"n_cols":3,"rows_kept":10,"cut":false,"hidden":true,"merged":[[9,2,11,8],[12,2,12,8],[14,2,15,8]]}
[]
[]
[]
[]
[]
[]
[]
[]
[]
[null,null,"Please wait. Your report is being refreshed…"]

{"sheet":"Support","index":2,"n_rows":11,"n_cols":3,"rows_kept":11,"cut":false,"hidden":true,"merged":[[10,2,12,8],[14,2,15,8]]}
[]
[]
[]
[]
[]
[]
[]
[]
[]
[]
[null,null,"Your report can't be refreshed as expected. \nPlease escalate as required."]

{"sheet":"Home","index":3,"n_rows":10,"n_cols":3,"rows_kept":10,"cut":false,"hidden":true,"merged":[[9,2,11,8],[17,2,17,8],[18,2,19,8]]}
[]
[]
[]
[]
[]
[]
[]
[]
[]
[null,null,"Your report is ready."]

{"sheet":"SelectionCriteria","index":4,"n_rows":8,"n_cols":2,"rows_kept":8,"cut":false,"hidden":true,"merged":[]}
["ASI Like-for-like Report"]
["Created on 14 Jun 2023 12:44:41 PM"]
["Report Filter Selections",""]
["For Organization","Aberdeen Standard Investments"]
["Select Group","All Groups"]
["Select Location","All Locations"]
["For a duration of","1  Year"]
["Ending with","2023/05/31"]

{"sheet":"Parameters","index":5,"n_rows":11,"n_cols":3,"rows_kept":11,"cut":false,"hidden":true,"merged":[]}
["Workbook Directory",{"$f":"SUBSTITUTE( LEFT(CELL(\"filename\",A1),FIND(\"]\",CELL(\"filename\",A1))-1),\"[\",\"\")","v":"C:\\Users\\131504866\\Downloads\\ASI_LFL_Report_V_3_3_2023-06-14-12-44-43.xlsm"}]
[]
["Additional Refresh",1]
[]
["Configure column types below"]
[]
["Column header","Type","Column Index"]
["Start Period","DMY",{"$f":"IFERROR(MATCH(ColumnTypes[[#This Row],[Column header]],DataSheet!$1:$1,0),0)","v":5}]
["End Period","DMY",{"$f":"IFERROR(MATCH(ColumnTypes[[#This Row],[Column header]],DataSheet!$1:$1,0),0)","v":6}]
["Acq. Date","MDY",{"$f":"IFERROR(MATCH(ColumnTypes[[#This Row],[Column header]],DataSheet!$1:$1,0),0)","v":12}]
["Disp. Date","MDY",{"$f":"IFERROR(MATCH(ColumnTypes[[#This Row],[Column header]],DataSheet!$1:$1,0),0)","v":13}]

{"sheet":"DataSheet","index":6,"n_rows":1044,"n_cols":49,"rows_kept":1044,"cut":false,"hidden":true,"merged":[]}
["Level 1 Group","Level 2 Group","Level 3 Group","Site Name","Start Period","End Period","Location Type","Asset No.","Operational Status","Operational Control","Like-for-Like Status","Acq. Date","Disp. Date","Electricity - LL procured LL","Electricity - LL procured tenant","Electricity - Tenant procured tenant","Electricity - LL procured LL Previous Year","Electricity - LL procured tenant Previous Year","Electricity - Tenant procured tenant Previous Year","Electricity Emissions - LL procured LL","Electricity Emissions - LL procured tenant","Electricity Emissions - Tenant procured tenant","Electricity Emissions - LL procured LL Previous Year","Electricity Emissions - LL procured tenant Previous Year","Electricity Emissions - Tenant procured tenant Previous Year","Non-Renewable Electricity","Renewable Electricity","Non-Renewable Electricity Previous Year","Renewable Electricity Previous Year","Natural Gas - LL procured LL","Natural Gas - LL procured tenant","Natural Gas - Tenant procured tenant","Natural Gas - LL procured LL Previous Year","Natural Gas - LL procured tenant Previous Year","Natural Gas - Tenant procured tenant Previous Year","Natural Gas Emissions - LL procured LL","Natural Gas Emissions - LL procured tenant","Natural Gas Emissions - Tenant procured tenant","Natural Gas Emissions - LL procured LL Previous Year","Natural Gas Emissions - LL procured tenant Previous Year","Natural Gas Emissions - Tenant procured tenant Previous Year","Water - LL procured LL","Water - LL procured tenant","Water - Tenant procured tenant","Water - LL procured LL Previous Year","Water - LL procured tenant Previous Year","Water - Tenant procured tenant Previous Year","Net Lett. Area","Gross Area"]
["AIPUT","Industrial, Distribution Whse-AIPUT","Industrial, Distribution Whse-AIPUT","dnata City East_Unit 1","01 Jun 2022","31 May 2023","Industrial, Distribution Warehouse","6016","New Construction","Indirectly Managed","Exclude","","","","","","","","","","","","","","","","","","","","","","","","","","","","","","","","","","","","",13748.7482,""]
["AIPUT","Industrial, Distribution Whse-AIPUT","Industrial, Distribution Whse-AIPUT","Gatwick_Viking House","01 Jun 2022","31 May 2023","Industrial, Distribution Warehouse","6005","Operational","Indirectly Managed","Include","","","","","","","","","","","","","","","","","","","","","","","","","","","","","","","","","","","","",3590.3175999999999,""]
["AIPUT","Industrial, Distribution Whse-AIPUT","Industrial, Distribution Whse-AIPUT","Heathrow_Airmail Unit","01 Jun 2022","31 May 2023","Industrial, Distribution Warehouse","6018","Operational","Indirectly Managed","Include","","","","","","","","","","","","","","","","","","","","","","","","","","","","","","","","","","","","",550,""]
["AIPUT","Industrial, Distribution Whse-AIPUT","Industrial, Distribution Whse-AIPUT","Heathrow_BA Perishables W'hse","01 Jun 2022","31 May 2023","Industrial, Distribution Warehouse","6003","Operational","Indirectly Managed","Include","","","","","","","","","","","","","","","","","","","","","","","","","","","","","","","","","","","","",592,""]
["AIPUT","Industrial, Distribution Whse-AIPUT","Industrial, Distribution Whse-AIPUT","Heathrow_Servisair Blding 521","01 Jun 2022","31 May 2023","Industrial, Distribution Warehouse","6019","Operational","Indirectly Managed","Include","","","","","","","","","","","","","","","","","","","","","","","","","","","","","","","","","","","","",4993.1466,""]
["AIPUT","Industrial, Distribution Whse-AIPUT","Industrial, Distribution Whse-AIPUT","Heathrow_Shorthaul Catering","01 Jun 2022","31 May 2023","Industrial, Distribution Warehouse","6004","Operational","Indirectly Managed","Include","","","","","","","","","","","","","","","","","","","","","","","","","","","","","","","","","","","","",10228.1468,""]
["AIPUT","Industrial, Distribution Whse-AIPUT","Industrial, Distribution Whse-AIPUT","Luton_Kingsway_Trade City Luton","01 Jun 2022","31 May 2023","Industrial, Distribution Warehouse","06034","Operational","Directly Managed","Include","2022-05-20","",6740.9,"","",108,"","",1303.56,"","",20.89,"","",6740.9,"",108,"","","","","","","","","","","","","","","","","","","","",""]
["AIPUT","Industrial, Distribution Whse-AIPUT","Industrial, Distribution Whse-AIPUT","SOLD_Heathrow_Cargo Point","01 Jun 2022","31 May 2023","Industrial, Distribution Warehouse","6002","Operational","Indirectly Managed","Exclude","","2022-10-14","","","","","","","","","","","","","","","","","","","","","","","","","","","","","","","","","","",1204,""]
["AIPUT","Industrial, Distribution Whse-AIPUT","Industrial, Distribution Whse-AIPUT","Stansted_Alpha Catering Base","01 Jun 2022","31 May 2023","Industrial, Distribution Warehouse","6001","Operational","Indirectly Managed","Include","","","","","","","","","","","","","","","","","","","","","","","","","","","","","","","","","","","","",5372.5969999999998,""]
["AIPUT","Industrial, Industrial Park-AIPUT","Industrial, Industrial Park-AIPUT","Crawley_The_Fleming_Centre","01 Jun 2022","31 May 2023","Industrial, Business Parks","6032","Operational","Directly Managed","Include","2021-10-01","",2540.86,"","",1903.04,"","",491.35,"","",381.59,"","","",2540.86,"",1903.04,"","","","","","","","","","","","","","","","","","",8360.7162000000008,""]
["AIPUT","Industrial, Industrial Park-AIPUT","Industrial, Industrial Park-AIPUT","Feltham_Radius Park","01 Jun 2022","31 May 2023","Industrial, Business Parks","6023","Operational","Indirectly Managed","Include","","",30302.14,"","",34206.85,"","",5859.83,"","",6979.94,"","","","","","","","","","","","","","","","","","","","","","","","",13403.5764,""]
["AIPUT","Industrial, Industrial Park-AIPUT","Industrial, Industrial Park-AIPUT","Gatwick_Gatwick Gate Units 1A to 1D","01 Jun 2022","31 May 2023","Industrial, Business Parks","6007","Operational","Indirectly Managed","Include","","","","","","","","","","","","","","","","","","","","","","","","","","","","","","","","","","","","",3431.5904,""]
["AIPUT","Industrial, Industrial Park-AIPUT","Industrial, Industrial Park-AIPUT","Heathrow_Airport Gate","01 Jun 2022","31 May 2023","Industrial, Business Parks","6012","Operational","Indirectly Managed","Include","","",7638.9,"","",8746.1,"","",1477.21,"","",1786.5,"","","","","","","","","","","","","","","","","","","","","","","","",8017.6687000000002,""]
["AIPUT","Industrial, Industrial Park-AIPUT","Industrial, Industrial Park-AIPUT","Heathrow_Camgate Centre","01 Jun 2022","31 May 2023","Industrial, Business Parks","6025","Major Refurbishment","Indirectly Managed","Exclude","","",5185.84,"","",6310.71,"","",1002.84,"","",1287.1500000000001,"","","","","","","","","","","","","","","","","","","","","","","","",1990.4972,""]
["AIPUT","Industrial, Industrial Park-AIPUT","Industrial, Industrial Park-AIPUT","Heathrow_Colnbrook_Poyle_Road_Manor_Farm","01 Jun 2022","31 May 2023","Industrial, Business Parks","6031","Operational","Directly Managed","Include","2021-09-21","",117741.24,108093.19,"",62731.66,49657.81,"",22768.799999999999,20903.060000000001,"",12592.37,9958.01,"",14326.74,211507.69,11520.16,100869.31,27604.59,"","",26259.02,"","",5038.9399999999996,"","",4799.24,"","","","","","","","","",""]
["AIPUT","Industrial, Industrial Park-AIPUT","Industrial, Industrial Park-AIPUT","Heathrow_South Cargo Centre","01 Jun 2022","31 May 2023","Industrial, Business Parks","6015","Operational","Indirectly Managed","Include","","",18594.419999999998,"","",29047.84,"","",3595.79,"","",5945.15,"","","","","","","","","","","","","","","","","","","","","","","","",12021.615400000001,""]
["AIPUT","Industrial, Industrial Park-AIPUT","Industrial, Industrial Park-AIPUT","Hounslow_Central Park Trading","01 Jun 2022","31 May 2023","Industrial, Business Parks","6010","Operational","Indirectly Managed","Include","","",13360.83,"","",16027.17,"","",2583.7199999999998,"","",3257.75,"","","","","","","","","","","","","","","","","","","","","","","","",9006.4838,""]
["AIPUT","Industrial, Industrial Park-AIPUT","Industrial, Industrial Park-AIPUT","Poyle_Blackthorne Crescent IE","01 Jun 2022","31 May 2023","Industrial, Business Parks","6022","Operational","Indirectly Managed","Include","","",10286.6,"","",13778.19,"","",1989.22,"","",2808.98,"","","","","","","","","","","","","","","","","","","","","","","","",10531.233200000001,""]
["AIPUT","Industrial, Industrial Park-AIPUT","Industrial, Industrial Park-AIPUT","Stansted_Site B_Taylor's End","01 Jun 2022","31 May 2023","Industrial, Business Parks","6009","Operational","Indirectly Managed","Include","","","","","","","","","","","","","","","","","","","","","","","","","","","","","","","","","","","","",5527.0078000000003,""]
{"$rows_left_out":1025}
{"sheet":"Electricity","index":7,"n_rows":635,"n_cols":30,"rows_kept":635,"cut":false,"hidden":true,"merged":[]}
[]
[]
["Like-for-Like Status","Include"]
["Level 1 Group","(All)"]
[]
["Level 2 Group","Level 3 Group","Site Name","Net Lettable Area","Landlord Consumption (kWh) Previous Year","Landlord Emissions (kg CO2e) Previous Year","Landlord Consumption (kWh)","Landlord Emissions (kg CO2e)","Landlord % Change Consumption (%)","Landlord % Change Emissions (%)","Tenant Consumption (kWh) Previous Year","Tenant Emissions (kgCO2e) Previous Year","Tenant Consumption (kWh)","Tenant Emissions (kgCO2e)","Tenant % Change Consumption (%)","Tenant % Change Emissions (%)","Renewable Electricity (kWh) Previous Year","Non-Renewable Electricity (kWh) Previous Year","Percent Renewable (%) Previous Year","Renewable Electricity (kWh)","Non-Renewable Electricity (kWh)","Percent Renewable (%)","Total Electricity Consumption (kWh) Previous Year","Total Electricity Consumption (kWh)","Total Electricity Consumption Intensity (kWh/m2) Previous Year","Total Electricity Consumption Intensity (kWh/m2)","Total Electricity Emissions (kg CO2e) Previous Year","Total Electricity Emissions (kg CO2e)","Total Electricity Emissions Intensity (kg CO2e/m2) Previous Year","Total Electricity Emissions Intensity (kg CO2e/m2)"]
["Americas","Brazil","Sao Paolo",0,0,0,0,0,0,0,0,0,0,0,0,0,0,0,0,0,0,0,0,0,0,0,0,0,0,0]
[null,"Canada","Toronto",0,0,0,0,0,0,0,0,0,0,0,0,0,0,0,0,0,0,0,0,0,0,0,0,0,0,0]
[null,"USA","Americas Travel",0,0,0,0,0,0,0,0,0,0,0,0,0,0,0,0,0,0,0,0,0,0,0,0,0,0,0]
[null,null,"Boston 2",0,0,0,0,0,0,0,0,0,0,0,0,0,0,0,0,0,0,0,0,0,0,0,0,0,0,0]
[null,null,"Los Angeles - Wilshire Boulevard",0,0,0,0,0,0,0,0,0,0,0,0,0,0,0,0,0,0,0,0,0,0,0,0,0,0,0]
[null,null,"Miami",0,0,0,0,0,0,0,0,0,0,0,0,0,0,0,0,0,0,0,0,0,0,0,0,0,0,0]
[null,null,"New York",0,0,0,0,0,0,0,0,0,0,0,0,0,0,0,0,0,0,0,0,0,0,0,0,0,0,0]
[null,null,"Philadelphia",0,0,0,0,0,0,0,0,0,0,0,0,0,0,0,0,0,0,0,0,0,0,0,0,0,0,0]
[null,null,"Stamford",0,0,0,0,0,0,0,0,0,0,0,0,0,0,0,0,0,0,0,0,0,0,0,0,0,0,0]
[null,null,"zz_Boston",0,0,0,0,0,0,0,0,0,0,0,0,0,0,0,0,0,0,0,0,0,0,0,0,0,0,0]
["Americas Total",null,null,0,0,0,0,0,0,0,0,0,0,0,0,0,0,0,0,0,0,0,0,0,0,0,0,0,0,0]
["Asia-Pacific","Australia","Melbourne",0,0,0,0,0,0,0,0,0,0,0,0,0,0,0,0,0,0,0,0,0,0,0,0,0,0,0]
[null,null,"Sydney",0,0,0,0,0,0,0,0,0,0,0,0,0,0,0,0,0,0,0,0,0,0,0,0,0,0,0]
[null,"China","Beijing",0,0,0,0,0,0,0,0,0,0,0,0,0,0,0,0,0,0,0,0,0,0,0,0,0,0,0]
{"$rows_left_out":616}
{"sheet":"Gas","index":8,"n_rows":635,"n_cols":24,"rows_kept":635,"cut":false,"hidden":true,"merged":[]}
[]
[]
["Like-for-Like Status","Include"]
["Level 1 Group","(All)"]
[]
["Level 2 Group","Level 3 Group","Site Name","Net Lettable Area","Landlord Gas Consumption (kWh) Previous Year","Landlord Gas Emissions (kg CO2e)  Previous Year","Landlord Gas Consumption (kWh)","Landlord Gas Emissions (kg CO2e)","Landlord % Change Gas Consumption (%)","Landlord % Change Gas Emissions (%)","Tenant Gas Consumption (kWh) Previous Year","Tenant Gas Emissions (kg CO2e) Previous Year","Tenant Gas Consumption (kWh)","Tenant Gas Emissions (kg CO2e)","Tenant % Change Gas Consumption (%)","Tenant % Change Gas Emissions (%)","Total Gas Consumption (kWh) Previous Year","Total Gas Consumption (kWh)","Total Gas Consumption Intensity (kWh/m2) Previous Year","Total Gas Consumption Intensity (kWh/m2)","Total Gas Emissions (kg CO2e) Previous Year","Total Gas Emissions (kg CO2e)","Total Gas Emissions Intensity (kg CO2e/m2) Previous Year","Total Gas Emissions Intensity (kg CO2e/m2)"]
["Americas","Brazil","Sao Paolo",0,0,0,0,0,0,0,0,0,0,0,0,0,0,0,0,0,0,0,0,0]
[null,"Canada","Toronto",0,0,0,0,0,0,0,0,0,0,0,0,0,0,0,0,0,0,0,0,0]
[null,"USA","Americas Travel",0,0,0,0,0,0,0,0,0,0,0,0,0,0,0,0,0,0,0,0,0]
[null,null,"Boston 2",0,0,0,0,0,0,0,0,0,0,0,0,0,0,0,0,0,0,0,0,0]
[null,null,"Los Angeles - Wilshire Boulevard",0,0,0,0,0,0,0,0,0,0,0,0,0,0,0,0,0,0,0,0,0]
[null,null,"Miami",0,0,0,0,0,0,0,0,0,0,0,0,0,0,0,0,0,0,0,0,0]
[null,null,"New York",0,0,0,0,0,0,0,0,0,0,0,0,0,0,0,0,0,0,0,0,0]
[null,null,"Philadelphia",0,0,0,0,0,0,0,0,0,0,0,0,0,0,0,0,0,0,0,0,0]
[null,null,"Stamford",0,0,0,0,0,0,0,0,0,0,0,0,0,0,0,0,0,0,0,0,0]
[null,null,"zz_Boston",0,0,0,0,0,0,0,0,0,0,0,0,0,0,0,0,0,0,0,0,0]
["Americas Total",null,null,0,0,0,0,0,0,0,0,0,0,0,0,0,0,0,0,0,0,0,0,0]
["Asia-Pacific","Australia","Melbourne",0,0,0,0,0,0,0,0,0,0,0,0,0,0,0,0,0,0,0,0,0]
[null,null,"Sydney",0,0,0,0,0,0,0,0,0,0,0,0,0,0,0,0,0,0,0,0,0]
[null,"China","Beijing",0,0,0,0,0,0,0,0,0,0,0,0,0,0,0,0,0,0,0,0,0]
{"$rows_left_out":616}
{"sheet":"Water","index":9,"n_rows":635,"n_cols":14,"rows_kept":635,"cut":false,"hidden":true,"merged":[]}
[]
[]
["Like-for-Like Status","Include"]
["Level 1 Group","(All)"]
[]
["Level 2 Group","Level 3 Group","Site Name","Net Lettable Area","Landlord Water Consumption (m3) Previous Year","Landlord Water Consumption (m3)","Landlord % Change Water Consumption (%)","Tenant Water Consumption (m3) Previous Year","Tenant Water Consumption (m3)","Tenant % Change Water Consumption (%)","Total Water Consumption (m3)","Total Water Consumption (m3) Previous Year","Total Water Consumption Intensity (m3/m2)","Total Water Consumption Intensity (m3/m2) Previous Year"]
["Americas","Brazil","Sao Paolo",0,0,0,0,0,0,0,0,0,0,0]
[null,"Canada","Toronto",0,0,0,0,0,0,0,0,0,0,0]
[null,"USA","Americas Travel",0,0,0,0,0,0,0,0,0,0,0]
[null,null,"Boston 2",0,0,0,0,0,0,0,0,0,0,0]
[null,null,"Los Angeles - Wilshire Boulevard",0,0,0,0,0,0,0,0,0,0,0]
[null,null,"Miami",0,0,0,0,0,0,0,0,0,0,0]
[null,null,"New York",0,0,0,0,0,0,0,0,0,0,0]
[null,null,"Philadelphia",0,0,0,0,0,0,0,0,0,0,0]
[null,null,"Stamford",0,0,0,0,0,0,0,0,0,0,0]
[null,null,"zz_Boston",0,0,0,0,0,0,0,0,0,0,0]
["Americas Total",null,null,0,0,0,0,0,0,0,0,0,0,0]
["Asia-Pacific","Australia","Melbourne",0,0,0,0,0,0,0,0,0,0,0]
[null,null,"Sydney",0,0,0,0,0,0,0,0,0,0,0]
[null,"China","Beijing",0,0,0,0,0,0,0,0,0,0,0]
{"$rows_left_out":616}
{"sheet":"Total Building","index":10,"n_rows":635,"n_cols":14,"rows_kept":635,"cut":false,"hidden":true,"merged":[]}
[]
[]
["Like-for-Like Status","Include"]
["Level 1 Group","(All)"]
[]
["Level 2 Group","Level 3 Group","Site Name","Net Lettable Area","Total Building Consumption (kWh) Previous Year","Total Building Consumption (kWh)","Total Building % Change Consumption (%)","Total Building Consumption Intensity (kWh/m2) Previous Year","Total Building Consumption Intensity (kWh/m2)","Total Building Emissions (kg CO2e) Previous Year","Total Building Emissions (kg CO2e)","Total Building % Change Emissions (%)","Total Building Emissions Intensity (kg CO2e/m2) Previous Year","Total Building Emissions Intensity (kg CO2e/m2)"]
["Americas","Brazil","Sao Paolo",0,0,0,0,0,0,0,0,0,0,0]
[null,"Canada","Toronto",0,0,0,0,0,0,0,0,0,0,0]
[null,"USA","Americas Travel",0,0,0,0,0,0,0,0,0,0,0]
[null,null,"Boston 2",0,0,0,0,0,0,0,0,0,0,0]
[null,null,"Los Angeles - Wilshire Boulevard",0,0,0,0,0,0,0,0,0,0,0]
[null,null,"Miami",0,0,0,0,0,0,0,0,0,0,0]
[null,null,"New York",0,0,0,0,0,0,0,0,0,0,0]
[null,null,"Philadelphia",0,0,0,0,0,0,0,0,0,0,0]
[null,null,"Stamford",0,0,0,0,0,0,0,0,0,0,0]
[null,null,"zz_Boston",0,0,0,0,0,0,0,0,0,0,0]
["Americas Total",null,null,0,0,0,0,0,0,0,0,0,0,0]
["Asia-Pacific","Australia","Melbourne",0,0,0,0,0,0,0,0,0,0,0]
[null,null,"Sydney",0,0,0,0,0,0,0,0,0,0,0]
[null,"China","Beijing",0,0,0,0,0,0,0,0,0,0,0]
{"$rows_left_out":616}
{"sheet":"Calculated Field Definitions","index":11,"n_rows":74,"n_cols":3,"rows_kept":74,"cut":false,"hidden":true,"merged":[]}
["Calculated Field"]
["Solve Order","Field","Formula"]
[1,"Tenant Consumption","='Electricity - LL procured tenant'+'Electricity - Tenant procured tenant'"]
[2,"Landlord Consumption","='Electricity - LL procured LL'-'Electricity - LL procured tenant'"]
[3,"Tenant Emissions","='Electricity Emissions - LL procured tenant'+'Electricity Emissions - Tenant procured tenant'"]
[4,"Landlord Emissions","='Electricity Emissions - LL procured LL'-'Electricity Emissions - LL procured tenant'"]
[5,"Percent Renewable","=IFERROR('Renewable Electricity'/('Renewable Electricity'+'Non-Renewable Electricity'),0)"]
[6,"Tenant Consumption Previous Year","='Electricity - LL procured tenant Previous Year'+'Electricity - Tenant procured tenant Previous Year'"]
[7,"Tenant Emissions Previous Year","='Electricity Emissions - LL procured tenant Previous Year'+'Electricity Emissions - Tenant procured tenant Previous Year'"]
[8,"Tenant % Change Consumption","=IFERROR(1-('Tenant Consumption Previous Year'/'Tenant Consumption'),0)"]
[9,"Tenant % Change Emissions","=IFERROR(1-('Tenant Emissions Previous Year'/'Tenant Emissions'),0)"]
[10,"Percent Renewable Previous Year","= IFERROR('Renewable Electricity Previous Year'/('Renewable Electricity Previous Year'+'Non-Renewable Electricity Previous Year'),0)"]
[11,"Landlord Consumption Previous Year","='Electricity - LL procured LL Previous Year'-'Electricity - LL procured tenant Previous Year'"]
[12,"Landlord Emissions Previous Year","='Electricity Emissions - LL procured LL Previous Year'-'Electricity Emissions - LL procured tenant Previous Year'"]
[13,"Landlord % Change Consumption","= IFERROR(1-('Landlord Consumption Previous Year'/'Landlord Consumption'),0)"]
[14,"Landlord % Change Emissions","= IFERROR(1-('Landlord Emissions Previous Year'/'Landlord Emissions'),0)"]
[15,"Tenant Gas Consumption","='Natural Gas - LL procured tenant'+'Natural Gas - Tenant procured tenant'"]
[16,"Landlord Gas Consumption","='Natural Gas - LL procured LL'-'Natural Gas - LL procured tenant'"]
[17,"Tenant Gas Emissions","='Natural Gas Emissions - LL procured tenant'+'Natural Gas Emissions - Tenant procured tenant'"]
[18,"Landlord Gas Emissions","='Natural Gas Emissions - LL procured LL'-'Natural Gas Emissions - LL procured tenant'"]
{"$rows_left_out":54}